{"text_format":"1","workbook":"xlsx","n_sheets":17,"sheets":["Postal Code Guide","Vendor","District","WHT","Vendor Change","VendorReqTbl","Postl codes","START","INSTRUCTIONS","Interest Indicator","Currency","Dropdowns","Payment term","reconccilliation accout","Country","Regions","regions table"],"not_rendered":{"charts":0,"images":6,"macros":1,"external_links":0,"defined_names":72,"comments":0,"pivot_tables":0},"unopened":[],"bounds":{"document_bytes":16777216,"sheet_cells":100000,"rows_first":2000,"rows_last":500,"rows_between":2000,"halvings":0,"cell_chars":16384,"cell_head_chars":4096},"cells_cut":0,"cells_raw":0,"read":"whole","date_system":"1900"}

{"sheet":"Postal Code Guide","index":0,"n_rows":58,"n_cols":10,"rows_kept":58,"cut":false,"hidden":true,"merged":[]}
[null,null,"Country","Length","Check Rule","Country Name",null,null,"Check Rule","Description"]
[null,null,"AR","4","4","Argentina",null,null,1,"Maximum value length, without gaps"]
[null,null,"AT","4","4","Austria",null,null,2,"Maximum value length, numerical, without gaps"]
[null,null,"AU","7","2","Australia",null,null,3,"Length to be kept to exactly, without gaps"]
[null,null,"BE","4","4","Belgium",null,null,4,"Length to be kept to exactly, numerical, without gaps"]
[null,null,"BG","4","4","Bulgaria",null,null,5,"Maximum value length"]
[null,null,"BR","9","7","Brazil",null,null,6,"Maximum value length, numerical"]
[null,null,"BY","6","4","Belarus",null,null,7,"Length to be kept to exactly"]
{"$rows_left_out":51}
{"sheet":"Vendor","index":1,"n_rows":43,"n_cols":40,"rows_kept":43,"cut":false,"hidden":true,"merged":[[37,32,37,33],[38,32,38,33],[32,6,32,7],[22,6,22,7],[35,38,35,39],[35,32,35,33],[32,38,32,39],[31,32,31,33],[28,3,28,14],[35,6,35,7],[30,12,30,13],[28,29,28,40],[32,32,32,33],[34,12,34,13],[31,12,31,13],[28,16,28,27],[10,29,10,40],[21,19,21,20],[13,19,13,23],[14,19,14,23],[15,19,15,23],[12,19,12,23],[37,6,37,7],[38,6,38,7],[9,32,9,35],[9,36,9,38],[23,32,23,33],[29,3,29,14],[33,3,33,14],[10,3,10,14],[22,32,22,33],[22,19,22,20],[23,19,23,20],[23,6,23,7],[10,16,10,27],[20,19,20,20],[17,19,17,20],[18,19,18,20],[2,1,4,1],[6,32,6,34],[6,1,8,1],[7,32,7,34],[0,3,4,14],[0,29,4,40],[0,16,4,27],[6,38,6,39],[6,36,6,37],[7,36,7,37],[0,1,1,1]]}
[null,"Select the specific 'VENDOR REQUIREMENT' from the list",null,"VENDOR CREATION",null,null,null,null,null,null,null,null,null,null,null,null,"VENDOR EXTENSION",null,null,null,null,null,null,null,null,null,null,null,null,"VENDOR CHANGE"]
[]
[null,"Vendor_Creation"]
[]
[]
[null,{"$f":"IF(OR(B10=VendorReqTbl!A2,B10=VendorReqTbl!A3,B10=VendorReqTbl!A4,B10=VendorReqTbl!A5,B10=VendorReqTbl!A6,B10=VendorReqTbl!A7),VendorReqTbl[[#Headers],[Vendor_Creation]],IF(OR(B10=VendorReqTbl!B2,B10=VendorReqTbl!B3,B10=VendorReqTbl!B4),VendorReqTbl[[#Headers],[Vendor_Extension]],IF(OR(B10=VendorReqTbl!C2,B10=VendorReqTbl!C3,B10=VendorReqTbl!C4),VendorReqTbl[[#Headers],[Vendor_Change]])))","v":"Vendor_Creation"}]
[null,"Select the specific 'VENDOR SUB-REQUIREMENT' from the list"]
[null,null,null,null,null,null,null,null,null,null,null,null,null,null,null,null,"Business Partner Code","*",2134567,null,null,null,null,null,null,null,null,null,null,"Business Partner Code","*",123456]
{"$rows_left_out":36}
{"sheet":"District","index":2,"n_rows":25,"n_cols":2,"rows_kept":25,"cut":false,"hidden":true,"merged":[]}
["COLOMBO"]
["GAMPAHA"]
["KALUTARA"]
["KANDY"]
["MATALE"]
["NUWARA ELIYA"]
["GALLE"]
["MATARA"]
{"$rows_left_out":18}
{"sheet":"WHT","index":3,"n_rows":52,"n_cols":3,"rows_kept":52,"cut":false,"hidden":true,"merged":[]}
["Wtax Type","P1 - (WHT Payment (Accumulation Month))","P1"]
[null,"P2 - (WHT Payment)","P2"]
[null,"NO Tax Type",0]
[]
[]
["Wtax Code","No Tax Code",0]
[null,"P1 - A2 (5% on Amt exceeding Rs.100,000 per Month)","A2"]
[null,"P1 - A3 (10% on Rent exceeding 100,000 Rs per Month)","A3"]
{"$rows_left_out":45}
{"sheet":"Vendor Change","index":4,"n_rows":5,"n_cols":4,"rows_kept":5,"cut":false,"hidden":true,"merged":[]}
["ChangeType","General_Info","Company_Code_Info","Purchasing_Org_Info"]
["General Information","Name","Reconciliation Account","Payment Term"]
["Other Information","Search term","Payment Term","Order Currency"]
[null,"Address","Interest Indicator"]
[null,"Email/Telephone"]

{"sheet":"VendorReqTbl","index":5,"n_rows":10,"n_cols":9,"rows_kept":10,"cut":false,"hidden":true,"merged":[]}
["Vendor_Creation","Vendor_Extension","Vendor_Change"]
["Z1DM Domestic Business Partners","Extend Both FI Vendor and Vendor","General Information"]
["Z2FR Foreign Business Partners","Extend Only FI Vendor","Other Information",null,null,null,null,null,{"$f":"INDEX(VendorReqTbl[],1,Col_Num_VendorReq):INDEX(VendorReqTbl[],COUNTA(Entire_Col_VendorReq),Col_Num_VendorReq)","v":{"$error":"#VALUE!"}}]
["Z5EM Employee Business Partners","Extend Only Vendor","Both General & Other Information"]
["Z6IL Investments/Loans Business Partners"]
["Z7ON One time Business Partners"]
["Z3IC Inter Company Business Partners"]
[null,null,null,null,null,null,null,null,"Z3IC Inter Company Business Partners"]
{"$rows_left_out":3}
{"sheet":"Postl codes","index":6,"n_rows":251,"n_cols":5,"rows_kept":251,"cut":false,"hidden":true,"merged":[]}
[" ","Format ",null,"Denomination ","Regex"]
["Afghanistan ",9999,{"$f":"LEN(B2)","v":4},"Post code ","Yes"]
["Åland Islands ",99999,{"$f":"LEN(B3)","v":5},"Postcode ","Yes"]
["Albania ",9999,4,"Kodi postar ","Yes"]
["Algeria ",99999,5,"Code postal ","Yes"]
["American Samoa ",99999,5,"Zip Code (US) ","Yes"]
["Andorra ","AA999 ",6,"Código postal ","Yes"]
["Angola ","- ",2,"Not used ","No"]
{"$rows_left_out":244}
{"sheet":"START","index":7,"n_rows":10,"n_cols":2,"rows_kept":10,"cut":false,"hidden":false,"merged":[[0,0,3,16383]]}
["                                           You must enable macros before using the vendor template"]
[]
[]
[]
[]
[]
[]
[]
{"$rows_left_out":3}
{"sheet":"INSTRUCTIONS","index":8,"n_rows":0,"n_cols":0,"rows_kept":0,"cut":false,"hidden":true,"merged":[]}

{"sheet":"Interest Indicator","index":9,"n_rows":3061,"n_cols":6,"rows_kept":3061,"cut":false,"hidden":true,"merged":[]}
["Interest calculation Indicator name","Interest Indicator"]
["No Interest"]
["10.00","BS"]
["10.01","BT",null,10]
["10.02","BU",null,{"$f":"_xlfn._xlws.FILTER(A2:A3061,ISNUMBER(SEARCH(Vendor!L32,A2:A3061)),\"Not found\")","v":"No Interest"},null,{"$f":"_xlfn._xlws.FILTER(A2:A2360,ISNUMBER(SEARCH(Vendor!AL33,A2:A2360)),\"Not found\")","v":"No Interest"}]
["10.03","BV",null,null,null,"10.00"]
["10.04","BW",null,null,null,"10.01"]
["10.05","BX",null,null,null,"10.02"]
{"$rows_left_out":3054}
{"sheet":"Currency","index":10,"n_rows":211,"n_cols":9,"rows_kept":211,"cut":false,"hidden":true,"merged":[]}
[null,null,null,"O35",null,null,"Z21",null,"AL36"]
["Sri Lankan Rupee - LKR","LKR",null,{"$f":"_xlfn._xlws.FILTER(A2:A211,ISNUMBER(SEARCH(Vendor!L35,A2:A211)),\"Not found\")","v":"Sri Lankan Rupee - LKR"},null,null,{"$f":"_xlfn._xlws.FILTER(A2:A211,ISNUMBER(SEARCH(Vendor!Z21,A2:A211)),\"Not found\")","v":"Sri Lankan Rupee - LKR"},null,{"$f":"_xlfn._xlws.FILTER(A2:A211,ISNUMBER(SEARCH(Vendor!AL36,A2:A211)),\"Not found\")","v":"Sri Lankan Rupee - LKR"}]
["United States Dollar - USD","USD",null,null,null,null,null,null,"United States Dollar - USD"]
["British Pound - GBP","GBP",null,null,null,null,null,null,"British Pound - GBP"]
["Andorran Peseta --> (Old --> EUR) - ADP","ADP",null,null,null,null,null,null,"Andorran Peseta --> (Old --> EUR) - ADP"]
["United Arab Emirates Dirham - AED","AED",null,null,null,null,null,null,"United Arab Emirates Dirham - AED"]
["Afghani (Old) - AFA","AFA",null,null,null,null,null,null,"Afghani (Old) - AFA"]
["Afghani - AFN","AFN",null,null,null,null,null,null,"Afghani - AFN"]
{"$rows_left_out":204}
{"sheet":"Dropdowns","index":11,"n_rows":250,"n_cols":16,"rows_kept":250,"cut":false,"hidden":true,"merged":[]}
["Company Code","Company Name","Grouping","Title","Country Name","Country Code","Schema Grp Supp","Purch.Org",null,"Company Code","Purch.Org",null,null,"BR Number",null,"Government Institutions"]
[1000,"E.B.Creasy  & Co.PLC","Z1DM Domestic Business Partners","0001 Ms.","Andorra","AD","S1",1000,null,"1000",1000,null,null,"NIC  Number",null,"Private Institution/Person"]
[1100,"Darley Butler & Co. Ltd","Z2FR Foreign Business Partners","0002 Mr.","United Arab Emirates","AE","S2",1600,null,"1100",1000,null,null,"Passport Number"]
[1200,"E.B Creasy Logistics Ltd","Z5EM Employee Business Partners","0003 Company","Afghanistan","AF",null,1800,null,"1200",1000]
[1300,"Candy Delights Limited","Z6IL Investments/Loans Business Partners",null,"Antigua and Barbuda","AG",null,2000,null,"1300",1000]
[1400,"Laxapana Batteries PLC","Z3IC Inter Company Business Partners",null,"Anguilla","AI",null,2100,null,"1400",1000]
[1500,"Muller& Phipps Ceylon PLC","Z7ON One time Business Partners",null,"Albania","AL",null,2200,null,"1500",1000]
[1550,"Pettah Pharmacy (Pvt) Ltd",null,null,"Armenia","AM",null,2300,null,"1550",1000]
{"$rows_left_out":243}
{"sheet":"Payment term","index":12,"n_rows":67,"n_cols":17,"rows_kept":67,"cut":false,"hidden":true,"merged":[]}
[null,null,null,"F33",null,null,null,null,"S19",null,null,null,"S22",null,"AF33",null,"AF36"]
["0001 -  Pay immediately w/o deduction","0001",null,{"$f":"_xlfn._xlws.FILTER(A2:A67,ISNUMBER(SEARCH(Vendor!F33,A2:A67)),\"Not found\")","v":"0002 -  14 days 2%, 30 net"},null,null,null,null,{"$f":"_xlfn._xlws.FILTER(A2:A67,ISNUMBER(SEARCH(Vendor!S19,A2:A67)),\"Not found\")","v":"0001 -  Pay immediately w/o deduction"},null,null,null,{"$f":"_xlfn._xlws.FILTER(A2:A67,ISNUMBER(SEARCH(Vendor!S22,A2:A67)),\"Not found\")","v":"0005 -  from the 10th of subs. month"},null,{"$f":"_xlfn._xlws.FILTER(A2:A67,ISNUMBER(SEARCH(Vendor!AF33,A2:A67)),\"Not found\")","v":"0001 -  Pay immediately w/o deduction"},null,{"$f":"_xlfn._xlws.FILTER(A2:A67,ISNUMBER(SEARCH(Vendor!AF36,A2:A67)),\"Not found\")","v":"0001 -  Pay immediately w/o deduction"}]
["0002 -  14 days 2%, 30 net","0002",null,null,null,null,null,null,null,null,null,null,null,null,"0002 -  14 days 2%, 30 net",null,"0002 -  14 days 2%, 30 net"]
["0003 -  14 days 3%, 20/2%, 30 net","0003",null,null,null,null,null,null,null,null,null,null,null,null,"0003 -  14 days 3%, 20/2%, 30 net",null,"0003 -  14 days 3%, 20/2%, 30 net"]
["0004 -  as of end of month","0004",null,null,null,null,null,null,null,null,null,null,null,null,"0004 -  as of end of month",null,"0004 -  as of end of month"]
["0005 -  from the 10th of subs. month","0005",null,null,null,null,null,null,null,null,null,null,null,null,"0005 -  from the 10th of subs. month",null,"0005 -  from the 10th of subs. month"]
["0006 -  End of month 4%, Mid-month 2%","0006",null,null,null,null,null,null,null,null,null,null,null,null,"0006 -  End of month 4%, Mid-month 2%",null,"0006 -  End of month 4%, Mid-month 2%"]
["0007 -  15th/31st subs. month 2%, ...","0007",null,null,null,null,null,null,null,null,null,null,null,null,"0007 -  15th/31st subs. month 2%, ...",null,"0007 -  15th/31st subs. month 2%, ..."]
{"$rows_left_out":60}
{"sheet":"reconccilliation accout","index":13,"n_rows":56,"n_cols":2,"rows_kept":56,"cut":false,"hidden":true,"merged":[]}
["Advance for Capital Goods - Domestic",10002020]
["Advance for Capital Goods - Import",10002030]
["Advance for Capital Goods - Import",10002040]
["Advance for Capital Goods - Import",10002050]
["Advance for Capital Goods - Import",10002060]
["Advances - Domestic Vendors",10100000]
["Advances - Import Vendors",10100010]
["Advances - Inter Company Vendors",10100150]
{"$rows_left_out":49}
{"sheet":"Country","index":14,"n_rows":250,"n_cols":253,"rows_kept":250,"cut":false,"hidden":true,"merged":[]}
["Long name","Country Key","Count of regions"]
["Andorra","AD",{"$error":"#N/A"},null,{"$f":"_xlfn._xlws.FILTER(country_list,ISNUMBER(SEARCH(country_,country_list)),\"Not Found\")","v":"Sri Lanka"}]
["United Arab Emirates","AE",{"$error":"#N/A"}]
["Afghanistan","AF",{"$error":"#N/A"},null,{"$f":"_xlfn._xlws.FILTER(country_list,ISNUMBER(SEARCH(CountryChange_,country_list)),\"Not Found\")","v":"Sri Lanka"},"Argentina","Austria","Australia","Belgium","Bulgaria","Brazil","Canada","Switzerland","Chile","China","Colombia","Czech Republic","Germany","Denmark","Egypt","Spain","Finland","France","United Kingdom","Greece","Hong Kong","Croatia","Hungary","Indonesia","Ireland","Israel","India","Italy","Japan","South Korea","Kuwait","Kazakhstan","Mexico","Malaysia","Netherlands","Norway","New Zealand","Peru","Philippines","Poland","Portugal","Qatar","Romania","Russian Federation","Sweden","Singapore","Slovenia","Thailand","Turkey","Taiwan","Ukraine","USA","Venezuela","South Africa","Andorra","United Arab Emirates","Afghanistan","Antigua and Barbuda","Anguilla","Albania","Armenia","Angola","Antarctica","American Samoa","Aruba","Azerbaijan","Bosnia and Herzegovina","Barbados","Bangladesh","Burkina Faso","Bahrain","Burundi","Benin","Blue","Bermuda","Brunei Darussalam","Bolivia","Bonaire, Sint Eustatius and Saba","Bahamas","Bhutan","Bouvet Islands","Botswana","Belarus","Belize","Cocos (Keeling) Islands","Democratic Republic of the Congo","Central African Republic","Republic of the Congo","Cote d'Ivoire","Cook Islands","Cameroon","Costa Rica","Serbia and Montenegro","Cuba","Cape Verde","Curacao","Christmas Islnd","Cyprus","Djibouti","Dominica","Dominican Republic","Algeria","Ecuador","Estonia","Western Sahara","Eritrea","Ethiopia","European Union","Fiji","Falkland Islands","Micronesia","Faroe Islands","Gabon","Grenada","Georgia","French Guyana","Guernsey (Channel Islands)","Ghana","Gibraltar","Greenland","Gambia","Guinea","Guadeloupe","Equatorial Guinea","South Georgia and the Southern Sandwich Islands","Guatemala","Guam","Guinea-Bissau","Guyana","Heard and McDonald Islands","Honduras","Haiti","Isle of Man","British Indian Ocean Territory","Iraq","Iran","Iceland","Jersey","Jamaica","Jordan","Kenya","Kyrgyzstan","Cambodia","Kiribati","Comoros","Saint Kitts and Nevis","North Korea","Cayman Islands","Laos","Lebanon","St. Lucia","Liechtenstein","Liberia","Lesotho","Lithuania","Luxembourg","Latvia","Libya","Morocco","Monaco","Moldova","Madagascar","Marshall Islands","Macedonia","Mali","Burma","Mongolia","Macau","North Mariana Islands","Martinique","Mauritania","Montserrat","Malta","Mauritius","Maldives","Malawi","Mozambique","Namibia","New Caledonia","Niger","Norfolk Islands","Nigeria","Nicaragua","Nepal","Nauru","NATO","Niue","Oman","Orange","Panama","French Polynesia","Papua New Guinea","Pakistan","St. Pierre and Miquelon","Pitcairn Islands","Puerto Rico","Palestine","Palau","Paraguay","Reunion","Rwanda","Saudi Arabia","Solomon Islands","Seychelles","Sudan","Saint Helena","Svalbard","Slovakia","Sierra Leone","San Marino","Senegal","Somalia","Suriname","South Sudan","Sao Tome and Principe","El Salvador","Sint Maarten (Dutch part)","Syria","Swaziland","Turks and Caicos Islands","Chad","French Southern and Antarctic Lands","Togo","Tajikistan","Tokelau Islands","East Timor","Turkmenistan","Tunisia","Tonga","East Timor2","Trinidad and Tobago","Tuvalu","Tanzania","Uganda","United States Minor Outlying Islands","United Nations","Uruguay","Uzbekistan","Vatican City","St. Vincent and the Grenadines","British Virgin Islands","United States Virgin Islands","Vietnam","Vanuatu","Wallis and Futuna Islands","Samoa","Yemen","Mayotte"]
["Antigua and Barbuda","AG",{"$error":"#N/A"}]
["Anguilla","AI",{"$error":"#N/A"}]
["Albania","AL",{"$error":"#N/A"}]
["Armenia","AM",{"$error":"#N/A"}]
{"$rows_left_out":243}
{"sheet":"Regions","index":15,"n_rows":1961,"n_cols":4,"rows_kept":1961,"cut":false,"hidden":true,"merged":[]}
["Country","Country Key","Description","Region"]
["Argentina","AR","Capital Federal","00"]
["Argentina","AR","Buenos Aires","01"]
["Argentina","AR","Catamarca","02"]
["Argentina","AR","Cordoba","03"]
["Argentina","AR","Corrientes","04"]
["Argentina","AR","Entre Rios","05"]
["Argentina","AR","Jujuy","06"]
{"$rows_left_out":1954}
{"sheet":"regions table","index":16,"n_rows":253,"n_cols":249,"rows_kept":253,"cut":false,"hidden":true,"merged":[]}
["Sri Lanka","Argentina","Austria","Australia","Belgium","Bulgaria","Brazil","Canada","Switzerland","Chile","China","Colombia","Czech Republic","Germany","Denmark","Egypt","Spain","Finland","France","United Kingdom","Greece","Hong Kong","Croatia","Hungary","Indonesia","Ireland","Israel","India","Italy","Japan","South Korea","Kuwait","Kazakhstan","Mexico","Malaysia","Netherlands","Norway","New Zealand","Peru","Philippines","Poland","Portugal","Qatar","Romania","Russian Federation","Sweden","Singapore","Slovenia","Thailand","Turkey","Taiwan","Ukraine","USA","Venezuela","South Africa","Andorra","United Arab Emirates","Afghanistan","Antigua and Barbuda","Anguilla","Albania","Armenia","Angola","Antarctica","American Samoa","Aruba","Azerbaijan","Bosnia and Herzegovina","Barbados","Bangladesh","Burkina Faso","Bahrain","Burundi","Benin","Blue","Bermuda","Brunei Darussalam","Bolivia","Bonaire, Sint Eustatius and Saba","Bahamas","Bhutan","Bouvet Islands","Botswana","Belarus","Belize","Cocos (Keeling) Islands","Democratic Republic of the Congo","Central African Republic","Republic of the Congo","Cote d'Ivoire","Cook Islands","Cameroon","Costa Rica","Serbia and Montenegro","Cuba","Cape Verde","Curacao","Christmas Islnd","Cyprus","Djibouti","Dominica","Dominican Republic","Algeria","Ecuador","Estonia","Western Sahara","Eritrea","Ethiopia","European Union","Fiji","Falkland Islands","Micronesia","Faroe Islands","Gabon","Grenada","Georgia","French Guyana","Guernsey (Channel Islands)","Ghana","Gibraltar","Greenland","Gambia","Guinea","Guadeloupe","Equatorial Guinea","South Georgia and the Southern Sandwich Islands","Guatemala","Guam","Guinea-Bissau","Guyana","Heard and McDonald Islands","Honduras","Haiti","Isle of Man","British Indian Ocean Territory","Iraq","Iran","Iceland","Jersey","Jamaica","Jordan","Kenya","Kyrgyzstan","Cambodia","Kiribati","Comoros","Saint Kitts and Nevis","North Korea","Cayman Islands","Laos","Lebanon","St. Lucia","Liechtenstein","Liberia","Lesotho","Lithuania","Luxembourg","Latvia","Libya","Morocco","Monaco","Moldova","Madagascar","Marshall Islands","Macedonia","Mali","Burma","Mongolia","Macau","North Mariana Islands","Martinique","Mauritania","Montserrat","Malta","Mauritius","Maldives","Malawi","Mozambique","Namibia","New Caledonia","Niger","Norfolk Islands","Nigeria","Nicaragua","Nepal","Nauru","NATO","Niue","Oman","Orange","Panama","French Polynesia","Papua New Guinea","Pakistan","St. Pierre and Miquelon","Pitcairn Islands","Puerto Rico","Palestine","Palau","Paraguay","Reunion","Rwanda","Saudi Arabia","Solomon Islands","Seychelles","Sudan","Saint Helena","Svalbard","Slovakia","Sierra Leone","San Marino","Senegal","Somalia","Suriname","South Sudan","Sao Tome and Principe","El Salvador","Sint Maarten (Dutch part)","Syria","Swaziland","Turks and Caicos Islands","Chad","French Southern and Antarctic Lands","Togo","Tajikistan","Tokelau Islands","East Timor","Turkmenistan","Tunisia","Tonga","East Timor2","Trinidad and Tobago","Tuvalu","Tanzania","Uganda","United States Minor Outlying Islands","United Nations","Uruguay","Uzbekistan","Vatican City","St. Vincent and the Grenadines","British Virgin Islands","United States Virgin Islands","Vietnam","Vanuatu","Wallis and Futuna Islands","Samoa","Yemen","Mayotte"]
["Central Province","Capital Federal","Burgenland","Aust Capital Terr","Antwerp","Burgas","Acre","Alberta","Aargau","I - Iquique","Beijing","ANTIOQUIA","Praha","Schleswig-Holstein","Danish Capital Reg.","Cairo","Alava","Ahvenanmaa","Ain","Aberdeenshire","Aitolia kai Akarnan.","Hong Kong Island","Zagrebacka","Bacs-Kiskun","DKI Jakarta Jakarta","Cork","Central","Andhra Pradesh","Agriento","Hokkaido","Cheju-do","Kuwait City","Almatynskaia","Aguascalientes","Johor","Drenthe","Ostfold County","Auckland","Tumbes","Ilocos","Dolnoslaskie","Minho-Lima","Doha","Alba","Adigeja Republic","Blekinge County","Singapore","Ajdov¹èina","Amnat Charoen","Adana","Fu-chien","Chernigivs'ka","Alaska","Amazon","Eastern Cape"," "," "," "," "," "," "," "," "," "," "," "," "," "," "," "," "," "," "," "," "," "," "," "," "," "," "," "," "," "," "," "," "," "," "," "," "," "," "," "," "," "," "," "," "," "," "," "," "," "," "," "," "," "," "," "," "," "," "," "," "," "," "," "," "," "," "," "," "," "," "," "," "," "," "," "," "," "," "," "," "," "," "," "," "," "," "," "," "," "," "," "," "," "," "," "," "," "," "," "," "," "," "," "," "," "," "," "," "," "," "," "," "," "," "," "," "," "," "," "," "," "," "," "," "," "," "," "," "," "," "," "," "," "," "," "," "," "," "," "," "," "," "," "," "," "," "," "," "," "," "," "," "," "," "," "," "," "," "," "," "," "," "," "," "," "," "," "," "," "," "," "," "," "," "," "," "," "," "," "," "," "," "," "," "," "," "," "," "," "," "," "," "," "," "]
["Eastern Province","Buenos Aires","Carinthia","New South Wales","Brabant","Grad Sofiya","Alagoas","British Columbia","Inner-Rhoden","II - Antofagasta","Shanghai","ATLANTICO","Stredocesky","Hamburg","Central Jutland","Giza","Albacete","Southern Finnland","Aisne","Argyllshire","Akhaia","Kowloon","Krapinsko-zagorska","Baranya","Jawa Barat West Java","Clare","Haifa","Arunachal Pradesh","Alessandria","Aomori","Cholla-bukto",null,"Kostanaiskaia","Baja California","Kedah","Flevoland","Akershus County","Bay of Plenty","Piura","Cagayan Valley","Kujawsko-Pomorskie","Cavado","The north","Arad","Highlands-Altay Rep.","Dalarnas County",null,"Beltinci","Ang Thong","Adiyaman","Kao-hsiung","Cherkas'ka","Alabama","Anzoategui","Free State"]
["Northern Province","Catamarca","Lower Austria","Northern Territory","Hainaut","Khaskovo","Amazon","Manitoba","Ausser-Rhoden","III - Copiapo","Tianjin","BOGOTA","Jihocesky","Lower Saxony","North Jutland","Al Sharqia","Alicante","Eastern Finnland","Allier","Anglesey","Argolis","New Territories","Sisacko-moslavacka","Bekes","Jawa Tengah Central","Cavan","Jerusalem","Assam","Ancona","Iwate","Cholla-namdo",null,"Severo-Kazakhstansk","Baja California S","Kelantan","Friesland","Oslo","Canterbury","Lambayeque","Central Luzon","Lubelskie","Ave","The west coast","Arges","Republ.of Bashkortos","Gotland County",null,"Bled","Buriram","Afyon","T´ai-pei","Chernovits'ka","Arkansas","Apure","Gauteng"]
["Western Province","Cordoba","Upper Austria","Queensland","Liege","Lovech","Amapa","New Brunswick","Bern","IV - La Serena","Nei Mongol","BOLIVAR","Plzensky","Bremen","Zealand","Dakahlia","Almeria","Lappi","Alpes (Hte-Provence)","Armagh","Arkadhia",null,"Karlovacka","Bekescsaba","Jawa Timur East Java","Carlow","Northern","Bihar","Aosta","Miyagi","Ch´ungch´ong-bukto",null,"Pavlodarskaia","Chihuahua","Kuala Lumpur","Gelderland","Hedmark County","Hawke´s Bay","La Libertad","South Luzon","Lubuskie","Grande Porto","The south","Bacau","Buryat Republic","Gaevleborg County",null,"Bohinj","Chachoengsao","Agri","Taiwan","Dnipropetrovs'ka","American Samoa","Aragua","Limpopo"]
["Southern Province","Corrientes","Salzburg","South Australia","Limburg","Montana","Bahia","Newfoundland/Labrad.","Basel Land","V - Valparaiso","Shanxi","BOYACA","Karlovarsky","Nrth Rhine Westfalia","South Denmark","Beheira","Avila","Western Finnland","Alpes (Hautes)","Angus/Forfarshire","Arta",null,"Varazdinska","Borsod-Abauj-Zemplen","DI Yogyakarta Yogyak","Dublin","Southern","Goa","Ascoli Piceno","Akita","Ch´ungch´ong-namdo",null,"Akmolinskaia","Chiapas","Labuan","Groningen","Oppland County","Manawatu-Wanganui","Ancash","Bicol","Lodzkie","Tamega",null,"Bihor","Dagestan Republic","Halland County",null,"Borovnica","Chai Nat","Amasya",null,"Donets'ka","Arizona","Barinas","Mpumalanga"]
["North Western Provin","Entre Rios","Styria","Tasmania","Luxembourg","Plovdiv","Ceara","Nova Scotia","Basel Stadt","VI - Rancagua","Hebei","CALDAS","Ustecky","Hessen",null,"Qalyubia","Badajoz","Oulu","Alpes-Maritimes","Antrim","Attiki",null,"Koprivnicko-krizevac","Budapest","DI Aceh Aceh","Donegal","Tel Aviv","Gujarat","L'Aquila","Yamagata","Inch´on-jikhalsi",null,"Aktubinskaia","Campeche","Melaka","Limburg","Buskerud County","Northland","Lima y Callao","West Visayas","Malopolskie","Entre Douro e Vouga",null,"Bistrita-Nasaud","Ingushetija Republic","Jaemtland County",null,"Bovec","Chaiyaphum","Ankara",null,"Harkivs'ka","California","Bolivar","Northern Cape"]
["North Central Provin","Jujuy","Tyrol","Victoria","Namur","Ruse","Brasilia","Northwest Territory","Fribourg","VII - Talca","Liaoning","CAQUETA","Liberecky","Rhineland Palatinate",null,"Minya","Baleares",null,"Ardeche","Ayrshire","Dhodhekanisos",null,"Bjelovarsko-bilogors","Csongrad","Sumatera Utara North","Galway",null,"Haryana","Arezzo","Fukushima","Kangwon-do",null,"Atyrauskaia","Coahuila","Pahang","Noord-Brabant","Vestfold County","Otago","Ica","Central Visayas","Mazowieckie","Douro",null,"Botosani","Kabardino-Balkar.Rep","Joenkoeping County",null,"Brda","Chanthaburi","Antalya",null,"Hmel'nits'ka","Colorado","Carabobo","Northwest"]
{"$rows_left_out":245}